Reaction Details
TargetRAC-beta serine/threonine-protein kinase
LigandBDBM50307946
Substrate/Competitorn/a
Meas. Tech.ChEMBL_608104 (CHEMBL1072809)
IC50 69±n/a nM
Citation McHardy, TCaldwell, JJCheung, KMHunter, LJTaylor, KRowlands, MRuddle, RHenley, Ade Haven Brandon, AValenti, MDavies, TGFazal, LSeavers, LRaynaud, FIEccles, SAAherne, GWGarrett, MDCollins, I Discovery of 4-amino-1-(7H-pyrrolo[2,3-d]pyrimidin-4-yl)piperidine-4-carboxamides as selective, orally active inhibitors of protein kinase B (Akt). J Med Chem53:2239-49 (2010) 
 
RAC-beta serine/threonine-protein kinase
Name:RAC-beta serine/threonine-protein kinase
Type:Enzyme
Mol. Mass.:55766.64
Organism:Homo sapiens (Human)
Description:n/a
Residue:481
BDBM50307946
NameBDBM50307946
Synonyms:CHEMBL603244 | N-((4-Amino-1-(7H-pyrrolo[2,3-d]pyrimidin-4-yl)piperidin-4-yl)methyl)-4-chlorobenzamide
TypeSmall organic molecule
Emp. Form.C19H21ClN6O
Mol. Mass.384.863
SMILESNC1(CNC(=O)c2ccc(Cl)cc2)CCN(CC1)c1ncnc2[nH]ccc12