Reaction Details
TargetCytochrome P450 1A2
LigandBDBM50237622
Substrate/Competitorn/a
Meas. Tech.ChEMBL_608355 (CHEMBL1074389)
IC50>10000±n/a nM
Citation McHardy, TCaldwell, JJCheung, KMHunter, LJTaylor, KRowlands, MRuddle, RHenley, Ade Haven Brandon, AValenti, MDavies, TGFazal, LSeavers, LRaynaud, FIEccles, SAAherne, GWGarrett, MDCollins, I Discovery of 4-amino-1-(7H-pyrrolo[2,3-d]pyrimidin-4-yl)piperidine-4-carboxamides as selective, orally active inhibitors of protein kinase B (Akt). J Med Chem53:2239-49 (2010) 
 
Cytochrome P450 1A2
Name:Cytochrome P450 1A2
Type:Enzyme
Mol. Mass.:58423.38
Organism:Homo sapiens (Human)
Description:P05177
Residue:516
BDBM50237622
NameBDBM50237622
Synonyms:4-(4-Chlorobenzyl)-1-(7H-pyrrolo[2,3-d]pyrimidin-4-yl)piperidin- CCT128930 US8796293, 17
TypeSmall organic molecule
Emp. Form.C18H20ClN5
Mol. Mass.341.838
SMILESNC1(Cc2ccc(Cl)cc2)CCN(CC1)c1ncnc2[nH]ccc12