Reaction Details
TargetExtracellular calcium-sensing receptor
LigandBDBM50308070
Substrate/Competitorn/a
Meas. Tech.ChEMBL_610755 (CHEMBL1064390)
IC50>30000±n/a nM
Citation Widler, LAltmann, EBeerli, RBreitenstein, WBouhelal, RBuhl, TGamse, RGerspacher, MHalleux, CJohn, MRLehmann, HKalb, OKneissel, MMissbach, MMüller, IRReidemeister, SRenaud, JTaillardat, ATommasi, RWeiler, SWolf, RMSeuwen, K 1-Alkyl-4-phenyl-6-alkoxy-1H-quinazolin-2-ones: a novel series of potent calcium-sensing receptor antagonists. J Med Chem53:2250-63 (2010) 
 
Extracellular calcium-sensing receptor
Name:Extracellular calcium-sensing receptor
Type:Protein
Mol. Mass.:120663.13
Organism:Homo sapiens (Human)
Description:P41180
Residue:1078
BDBM50308070
NameBDBM50308070
Synonyms:4-(1-Isopropyl-6-methoxy-2-oxo-1,2-dihydro-quinazolin-4-yl)-benzoic acid methyl ester | CHEMBL598445
TypeSmall organic molecule
Emp. Form.C20H20N2O4
Mol. Mass.352.3838
SMILESCOC(=O)c1ccc(cc1)-c1nc(=O)n(C(C)C)c2ccc(OC)cc12