Reaction Details
TargetExtracellular calcium-sensing receptor
LigandBDBM50308081
Substrate/Competitorn/a
Meas. Tech.ChEMBL_610755 (CHEMBL1064390)
IC50 1.6±n/a nM
Citation Widler, LAltmann, EBeerli, RBreitenstein, WBouhelal, RBuhl, TGamse, RGerspacher, MHalleux, CJohn, MRLehmann, HKalb, OKneissel, MMissbach, MMüller, IRReidemeister, SRenaud, JTaillardat, ATommasi, RWeiler, SWolf, RMSeuwen, K 1-Alkyl-4-phenyl-6-alkoxy-1H-quinazolin-2-ones: a novel series of potent calcium-sensing receptor antagonists. J Med Chem53:2250-63 (2010) 
 
Extracellular calcium-sensing receptor
Name:Extracellular calcium-sensing receptor
Type:Protein
Mol. Mass.:120663.13
Organism:Homo sapiens (Human)
Description:P41180
Residue:1078
BDBM50308081
NameBDBM50308081
Synonyms:4-(4-Isopropyl-phenyl)-1-(4-methyl-benzyl)-6-propargyloxy-1H-quinazolin-2-one | CHEMBL591240
TypeSmall organic molecule
Emp. Form.C28H26N2O2
Mol. Mass.422.5182
SMILESCC(C)c1ccc(cc1)-c1nc(=O)n(Cc2ccc(C)cc2)c2ccc(OCC#C)cc12