Reaction Details
TargetExtracellular calcium-sensing receptor
LigandBDBM50308092
Substrate/Competitorn/a
Meas. Tech.ChEMBL_610755 (CHEMBL1064390)
IC50 7.3±n/a nM
Citation Widler, LAltmann, EBeerli, RBreitenstein, WBouhelal, RBuhl, TGamse, RGerspacher, MHalleux, CJohn, MRLehmann, HKalb, OKneissel, MMissbach, MMüller, IRReidemeister, SRenaud, JTaillardat, ATommasi, RWeiler, SWolf, RMSeuwen, K 1-Alkyl-4-phenyl-6-alkoxy-1H-quinazolin-2-ones: a novel series of potent calcium-sensing receptor antagonists. J Med Chem53:2250-63 (2010) 
 
Extracellular calcium-sensing receptor
Name:Extracellular calcium-sensing receptor
Type:Protein
Mol. Mass.:120663.13
Organism:Homo sapiens (Human)
Description:P41180
Residue:1078
BDBM50308092
NameBDBM50308092
Synonyms:1-[3-(2-Hydroxy-ethoxy)-benzyl]-4-(4-isopropyl-phenyl)-6-propargyloxy-1H-quinazolin-2-one | CHEMBL597396
TypeSmall organic molecule
Emp. Form.C29H28N2O4
Mol. Mass.468.5436
SMILESCC(C)c1ccc(cc1)-c1nc(=O)n(Cc2cccc(OCCO)c2)c2ccc(OCC#C)cc12