Reaction Details
TargetProstaglandin E2 receptor EP4 subtype
LigandBDBM50308125
Substrate/Competitorn/a
Meas. Tech.ChEMBL_610072 (CHEMBL1073095)
IC50 3.6±n/a nM
Citation Blouin, MHan, YBurch, JFarand, JMellon, CGaudreault, MWrona, MLévesque, JFDenis, DMathieu, MCStocco, RVigneault, ETherien, AClark, PRowland, SXu, DO'Neill, GDucharme, YFriesen, R The discovery of 4-{1-[({2,5-dimethyl-4-[4-(trifluoromethyl)benzyl]-3-thienyl}carbonyl)amino]cyclopropyl}benzoic acid (MK-2894), a potent and selective prostaglandin E2 subtype 4 receptor antagonist. J Med Chem53:2227-38 (2010) 
 
Prostaglandin E2 receptor EP4 subtype
Name:Prostaglandin E2 receptor EP4 subtype
Type:Enzyme
Mol. Mass.:53134.53
Organism:Homo sapiens (Human)
Description:P35408
Residue:488
BDBM50308125
NameBDBM50308125
Synonyms:4-[(1S)-1-({[2,5-Dichloro-4-(3-chlorobenzyl)-3-thienyl]carbonyl}-amino)ethyl]benzoic Acid | CHEMBL599052
TypeSmall organic molecule
Emp. Form.C21H16Cl3NO3S
Mol. Mass.468.781
SMILESC[C@H](NC(=O)c1c(Cl)sc(Cl)c1Cc1cccc(Cl)c1)c1ccc(cc1)C(O)=O