Reaction Details
TargetProstaglandin E2 receptor EP4 subtype
LigandBDBM50308132
Substrate/Competitorn/a
Meas. Tech.ChEMBL_610072 (CHEMBL1073095)
IC50 2.3±n/a nM
Citation Blouin, MHan, YBurch, JFarand, JMellon, CGaudreault, MWrona, MLévesque, JFDenis, DMathieu, MCStocco, RVigneault, ETherien, AClark, PRowland, SXu, DO'Neill, GDucharme, YFriesen, R The discovery of 4-{1-[({2,5-dimethyl-4-[4-(trifluoromethyl)benzyl]-3-thienyl}carbonyl)amino]cyclopropyl}benzoic acid (MK-2894), a potent and selective prostaglandin E2 subtype 4 receptor antagonist. J Med Chem53:2227-38 (2010) 
 
Prostaglandin E2 receptor EP4 subtype
Name:Prostaglandin E2 receptor EP4 subtype
Type:Enzyme
Mol. Mass.:53134.53
Organism:Homo sapiens (Human)
Description:P35408
Residue:488
BDBM50308132
NameBDBM50308132
Synonyms:2,5-Dimethyl-N-{1-[4-(2H-tetrazol-5-yl)phenyl]cyclopropyl}-4-[4-(trifluoromethyl)benzyl]thiophene-3-carboxamide | CHEMBL598198
TypeSmall organic molecule
Emp. Form.C25H22F3N5OS
Mol. Mass.497.535
SMILESCc1sc(C)c(C(=O)NC2(CC2)c2ccc(cc2)-c2nnn[nH]2)c1Cc1ccc(cc1)C(F)(F)F