Reaction Details
TargetProstaglandin E2 receptor EP3 subtype
LigandBDBM50308131
Substrate/Competitorn/a
Meas. Tech.ChEMBL_610077 (CHEMBL1074442)
Ki 3300±n/a nM
Citation Blouin, MHan, YBurch, JFarand, JMellon, CGaudreault, MWrona, MLévesque, JFDenis, DMathieu, MCStocco, RVigneault, ETherien, AClark, PRowland, SXu, DO'Neill, GDucharme, YFriesen, R The discovery of 4-{1-[({2,5-dimethyl-4-[4-(trifluoromethyl)benzyl]-3-thienyl}carbonyl)amino]cyclopropyl}benzoic acid (MK-2894), a potent and selective prostaglandin E2 subtype 4 receptor antagonist. J Med Chem53:2227-38 (2010) 
 
Prostaglandin E2 receptor EP3 subtype
Name:Prostaglandin E2 receptor EP3 subtype
Type:Enzyme Catalytic Domain
Mol. Mass.:39958.37
Organism:RAT
Description:Prostaglandin E2 PTGER2 RAT::P34980
Residue:365
BDBM50308131
NameBDBM50308131
Synonyms:4-{1-[({2,5-Dimethyl-4-[4-(trifluoromethyl)benzyl]-3-thienyl}-carbonyl)amino]cyclopropyl}benzoic Acid | CHEMBL597997
TypeSmall organic molecule
Emp. Form.C25H22F3NO3S
Mol. Mass.473.507
SMILESCc1sc(C)c(C(=O)NC2(CC2)c2ccc(cc2)C(O)=O)c1Cc1ccc(cc1)C(F)(F)F