Reaction Details
TargetAcetylcholinesterase
LigandBDBM50308280
Substrate/Competitorn/a
Meas. Tech.ChEMBL_613843 (CHEMBL1067133)
Ki 61.1±n/a nM
Citation Rizzo, SBartolini, MCeccarini, LPiazzi, LGobbi, SCavalli, ARecanatini, MAndrisano, VRampa, A Targeting Alzheimer's disease: Novel indanone hybrids bearing a pharmacophoric fragment of AP2238. Bioorg Med Chem18:1749-60 (2010) 
 
Acetylcholinesterase
Name:Acetylcholinesterase
Type:Enzyme
Mol. Mass.:67792.70
Organism:Homo sapiens (Human)
Description:P22303
Residue:614
BDBM50308280
NameBDBM50308280
Synonyms:2-{4-[(Benzylmethylamino)methyl]benzylidene}-6-(5-piperidin-1-yl-pentyloxy)-3,4-dihydro-2H-naphthalen-1-one | CHEMBL599644
TypeSmall organic molecule
Emp. Form.C36H44N2O2
Mol. Mass.536.7468
SMILESCN(Cc1ccccc1)Cc1ccc(\C=C2/CCc3cc(OCCCCCN4CCCCC4)ccc3C2=O)cc1