Reaction Details
TargetSubstance-P receptor
LigandBDBM50308381
Substrate/Competitorn/a
Meas. Tech.ChEMBL_613946 (CHEMBL1068986)
Ki 1.6±n/a nM
Citation Fransson, RBotros, MSköld, CNyberg, FLindeberg, GHallberg, MSandström, A Discovery of dipeptides with high affinity to the specific binding site for substance P1-7. J Med Chem53:2383-9 (2010) 
 
Substance-P receptor
Name:Substance-P receptor
Type:G Protein-Coupled Receptor (GPCR)
Mol. Mass.:46371.54
Organism:Rattus norvegicus (rat)
Description:Competition binding assays were carried out using membrane preparations from transfected CHO cells that constitutively expressed the rat NK1 receptor.
Residue:407
BDBM50308381
NameBDBM50308381
Synonyms:CHEMBL589979 | H-Arg-Pro-Lys-Pro-Gln-Gln-Phe-OH
TypeSmall organic molecule
Emp. Form.C41H65N13O10
Mol. Mass.900.0359
SMILES[#7]-[#6]-[#6]-[#6]-[#6]-[#6@H](-[#7]-[#6](=O)-[#6@@H]-1-[#6]-[#6]-[#6]-[#7]-1-[#6](=O)-[#6@@H](-[#7])-[#6]-[#6]-[#6]\[#7]=[#6](/[#7])-[#7])-[#6](=O)-[#7]-1-[#6]-[#6]-[#6]-[#6@H]-1-[#6](=O)-[#7]-[#6@@H](-[#6]-[#6]-[#6](-[#7])=O)-[#6](=O)-[#7]-[#6@@H](-[#6]-[#6]-[#6](-[#7])=O)-[#6](=O)-[#7]-[#6@@H](-[#6]-c1ccccc1)-[#6](-[#8])=O