Reaction Details
TargetCannabinoid receptor 1
LigandBDBM50308544
Substrate/Competitorn/a
Meas. Tech.ChEMBL_613495 (CHEMBL1072261)
Ki>10000±n/a nM
Citation Gao, MWang, MMiller, KDHutchins, GDZheng, QH Synthesis and in vitro biological evaluation of carbon-11-labeled quinoline derivatives as new candidate PET radioligands for cannabinoid CB2 receptor imaging. Bioorg Med Chem18:2099-106 (2010) 
 
Cannabinoid receptor 1
Name:Cannabinoid receptor 1
Type:G Protein-Coupled Receptor (GPCR)
Mol. Mass.:52868.96
Organism:Homo sapiens (Human)
Description:P21554
Residue:472
BDBM50308544
NameBDBM50308544
Synonyms:2-Chloro-7-methoxy-8-pentyloxy-1-quinoline-3-carboxylic acid(3-phenylpropyl)amide | CHEMBL590765
TypeSmall organic molecule
Emp. Form.C25H29ClN2O3
Mol. Mass.440.962
SMILESCCCCCOc1c(OC)ccc2cc(C(=O)NCCCc3ccccc3)c(Cl)nc12