Reaction Details
TargetCannabinoid receptor 2
LigandBDBM50308537
Substrate/Competitorn/a
Meas. Tech.ChEMBL_613496 (CHEMBL1072262)
Ki 6.92±n/a nM
Citation Gao, MWang, MMiller, KDHutchins, GDZheng, QH Synthesis and in vitro biological evaluation of carbon-11-labeled quinoline derivatives as new candidate PET radioligands for cannabinoid CB2 receptor imaging. Bioorg Med Chem18:2099-106 (2010) 
 
Cannabinoid receptor 2
Name:Cannabinoid receptor 2
Type:G Protein-Coupled Receptor (GPCR)
Mol. Mass.:39690.94
Organism:Homo sapiens (Human)
Description:P34972
Residue:360
BDBM50308537
NameBDBM50308537
Synonyms:7-Methoxy-2-oxo-8-pentyloxy-1,2-dihydroquinoline-3-carboxylic Acid Phenethylamide CHEMBL381314
TypeSmall organic molecule
Emp. Form.C24H28N2O4
Mol. Mass.408.4901
SMILESCCCCCOc1c(OC)ccc2cc(C(=O)NCCc3ccccc3)c(=O)[nH]c12