Reaction Details
TargetcAMP-specific 3',5'-cyclic phosphodiesterase 4B
LigandBDBM50308557
Substrate/Competitorn/a
Meas. Tech.ChEMBL_613561 (CHEMBL1074187)
IC50>2000±n/a nM
Citation Hughes, RORogier, DJJacobsen, EJWalker, JKMacinnes, ABond, BRZhang, LLYu, YZheng, YRumsey, JMWalgren, JLCurtiss, SWFobian, YMHeasley, SECubbage, JWMoon, JBBrown, DLAcker, BAMaddux, TMTollefson, MBMischke, BVOwen, DRFreskos, JNMolyneaux, JMBenson, AGBlevis-Bal, RM Design, synthesis, and biological evaluation of 3-[4-(2-hydroxyethyl)piperazin-1-yl]-7-(6-methoxypyridin-3-yl)-1-(2-propoxyethyl)pyrido[3,4-b]pyrazin-2(1H)-one, a potent, orally active, brain penetrant inhibitor of phosphodiesterase 5 (PDE5). J Med Chem53:2656-60 (2010) 
 
cAMP-specific 3',5'-cyclic phosphodiesterase 4B
Name:cAMP-specific 3',5'-cyclic phosphodiesterase 4B
Type:Protein
Mol. Mass.:83318.87
Organism:Homo sapiens (Human)
Description:Q07343
Residue:736
BDBM50308557
NameBDBM50308557
Synonyms:3-(4-(2-hydroxyethyl)piperazin-1-yl)-1-(2-propoxyethyl)-7-(6-methoxypyridin-3-yl)pyrido[3,4-b]pyrazin-2(1H)-one | CHEMBL591501
TypeSmall organic molecule
Emp. Form.C24H32N6O4
Mol. Mass.468.5487
SMILESCCCOCCn1c2cc(ncc2nc(N2CCN(CCO)CC2)c1=O)-c1ccc(OC)nc1