Reaction Details
TargetAdenosine receptor A2b
LigandBDBM50308567
Substrate/Competitorn/a
Meas. Tech.ChEMBL_613654 (CHEMBL1066997)
Ki 1.39±n/a nM
Citation Hierrezuelo, JManuel López-Romero, JRico, RBrea, JIsabel Loza, MCai, CAlgarra, M Synthesis of theophylline derivatives and study of their activity as antagonists at adenosine receptors. Bioorg Med Chem18:2081-8 (2010) 
 
Adenosine receptor A2b
Name:Adenosine receptor A2b
Type:G Protein-Coupled Receptor (GPCR)
Mol. Mass.:36341.22
Organism:Homo sapiens (Human)
Description:n/a
Residue:332
BDBM50308567
NameBDBM50308567
Synonyms:CHEMBL592891 | N-(4-acetylphenyl)-2-(4-(7-methyl-2,6-dioxo-1,3-dipropyl-2,3,6,7-tetrahydro-1H-purin-8-yl)phenoxy)acetamide
TypeSmall organic molecule
Emp. Form.C28H31N5O5
Mol. Mass.517.5762
SMILESCCCn1c2nc(-c3ccc(OCC(=O)Nc4ccc(cc4)C(C)=O)cc3)n(C)c2c(=O)n(CCC)c1=O