Reaction Details
TargetBeta-secretase 1
LigandBDBM50308720
Substrate/Competitorn/a
Meas. Tech.ChEMBL_607316 (CHEMBL1073482)
Ki 11300±n/a nM
Citation Marumoto, SMiyazawa, M Biotransformation of isoimperatorin and imperatorin by Glomerella cingulata and beta-secretase inhibitory activity. Bioorg Med Chem18:455-9 (2010) 
 
Beta-secretase 1
Name:Beta-secretase 1
Type:Protein
Mol. Mass.:55755.10
Organism:Homo sapiens (Human)
Description:P56817
Residue:501
BDBM50308720
NameBDBM50308720
Synonyms:6,7-Furano-5-prenyloxy hydrocoumaric acid methyl ester | CHEMBL592382
TypeSmall organic molecule
Emp. Form.C17H20O5
Mol. Mass.304.3377
SMILES[#6]-[#8]-[#6](=O)-[#6]-[#6]-c1c(-[#8])cc2occc2c1-[#8]-[#6]\[#6]=[#6](\[#6])-[#6]