Reaction Details
TargetIntegrin alpha-V/beta-3
LigandBDBM50308722
Substrate/Competitorn/a
Meas. Tech.ChEMBL_607327 (CHEMBL1064843)
IC50 6.0±n/a nM
Citation Dal Pozzo, ANi, MHEsposito, EDallavalle, SMusso, LBargiotti, APisano, CVesci, LBucci, FCastorina, MFoderà, RGiannini, GAulicino, CPenco, S Novel tumor-targeted RGD peptide-camptothecin conjugates: synthesis and biological evaluation. Bioorg Med Chem18:64-72 (2010) 
 
Integrin alpha-V/beta-3
Name:Integrin alpha-V/beta-3
Type:Enzyme
Mol. Mass.:n/a
Description:n/a
Components:This complex has 2 components.
Component 1
Name:Integrin alpha-V
Synonyms:ITAV_HUMAN Integrin alpha-V/alpha-5 VNRA Vitronectin receptor | Vitronectin receptor subunit alpha
Type:PROTEIN
Mol. Mass.:116024.92
Organism:Homo sapiens (Human)
Description:ChEMBL_582336
Residue:1048
Component 2
Name:Integrin beta-3
Synonyms:CD_antigen=CD61 GPIIIa ITGB3 Platelet membrane glycoprotein IIIa
Type:Protein
Mol. Mass.:87038.91
Organism:Homo sapiens (Human)
Description:P05106
Residue:788
BDBM50308722
NameBDBM50308722
Synonyms:2-[(2S,5R,8S,11S)-5-benzyl-11-(3-carbamimidamidopropyl)-8-({4-[(2-{2-[2-({N'-[(1E)-3-[(19S)-19-ethyl-19-hydroxy-14,18-dioxo-17-oxa-3,13-diazapentacyclo[11.8.0.0^{2,11}.0^{4,9}.0^{15,20}]henicosa-1(21),2,4,6,8,10,15(20)-heptaen-10-yl]propylidene]hydrazinecarbonyl}methoxy)ethoxy]ethoxy}acetamido)methyl]phenyl}methyl)-3,6,9,12,15-pentaoxo-1,4,7,10,13-pentaazacyclopentadecan-2-yl]acetic acid | CHEMBL590628
TypeSmall organic molecule
Emp. Form.C62H73N13O16
Mol. Mass.1256.3205
SMILES[#6]-[#6][C@@]1([#8])[#6](=O)-[#8]-[#6]-c2c1cc1-c3nc4ccccc4c(-[#6]-[#6]-[#6]=[#7]-[#7]-[#6](=O)-[#6]-[#8]-[#6]-[#6]-[#8]-[#6]-[#6]-[#8]-[#6]-[#6](=O)-[#7]-[#6]-c4ccc(-[#6]-[#6@@H]-5-[#7]-[#6](=O)-[#6@@H](-[#6]-c6ccccc6)-[#7]-[#6](=O)-[#6@H](-[#6]-[#6](-[#8])=O)-[#7]-[#6](=O)-[#6]-[#7]-[#6](=O)-[#6@H](-[#6]-[#6]-[#6]\[#7]=[#6](\[#7])-[#7])-[#7]-[#6]-5=O)cc4)c3-[#6]-n1c2=O