Reaction Details
TargetSolute carrier family 15 member 1
LigandBDBM50308745
Substrate/Competitorn/a
Meas. Tech.ChEMBL_607731 (CHEMBL1066196)
IC50 630000±n/a nM
Citation Sun, JDahan, AAmidon, GL Enhancing the intestinal absorption of molecules containing the polar guanidino functionality: a double-targeted prodrug approach. J Med Chem53:624-32 (2010) 
 
Solute carrier family 15 member 1
Name:Solute carrier family 15 member 1
Type:PROTEIN
Mol. Mass.:78818.07
Organism:Homo sapiens (Human)
Description:ChEMBL_1488839
Residue:708
BDBM50308745
NameBDBM50308745
Synonyms:CHEMBL589585 | L-Isoleucine[3-[(Aminoiminomethyl)amino]phenyl]methyl Ester
TypeSmall organic molecule
Emp. Form.C14H22N4O2
Mol. Mass.278.3501
SMILES[#6]-[#6]-[#6@H](-[#6])-[#6@H](-[#7])-[#6](=O)-[#8]-[#6]-c1cccc(c1)\[#7]=[#6](/[#7])-[#7]