Reaction Details
TargetCarbonyl reductase [NADPH] 1
LigandBDBM50308752
Substrate/Competitorn/a
Meas. Tech.ChEMBL_607766 (CHEMBL1068737)
IC50 788±n/a nM
Citation Berhe, SSlupe, ALuster, CCharlier, HAWarner, DLZalkow, LHBurgess, EMEnwerem, NMBakare, O Synthesis of 3-[(N-carboalkoxy)ethylamino]-indazole-dione derivatives and their biological activities on human liver carbonyl reductase. Bioorg Med Chem18:134-41 (2010) 
 
Carbonyl reductase [NADPH] 1
Name:Carbonyl reductase [NADPH] 1
Type:PROTEIN
Mol. Mass.:30380.63
Organism:Homo sapiens (Human)
Description:ChEMBL_607770
Residue:277
BDBM50308752
NameBDBM50308752
Synonyms:3-(1-tert-butyl-4-amino-1H-pyrazolo[3,4-d]pyrimidin-3-yl)phenol | CHEMBL590508
TypeSmall organic molecule
Emp. Form.C15H19N5O
Mol. Mass.285.3443
SMILESCC(C)(C)N1NC(c2c1ncnc2N)c1cccc(O)c1