Reaction Details
TargetMitogen-activated protein kinase 14
LigandBDBM50308761
Substrate/Competitorn/a
Meas. Tech.ChEMBL_607570 (CHEMBL1073514)
IC50 94±n/a nM
Citation Dietrich, JGokhale, VWang, XHurley, LHFlynn, GA Application of a novel [3+2] cycloaddition reaction to prepare substituted imidazoles and their use in the design of potent DFG-out allosteric B-Raf inhibitors. Bioorg Med Chem18:292-304 (2010) 
 
Mitogen-activated protein kinase 14
Name:Mitogen-activated protein kinase 14
Type:Serine/threonine-protein kinase
Mol. Mass.:41286.76
Organism:Homo sapiens (Human)
Description:Q16539
Residue:360
BDBM50308761
NameBDBM50308761
Synonyms:CHEMBL591673 | N-(4-Methyl-3-(3-methyl-4-oxo-3,4-dihydroquinazolin-6-ylamino)phenyl)-2-(trifluoromethyl)-5-(3,4,5-trimethoxyphenyl)-1H-imidazole-4-carboxamide
TypeSmall organic molecule
Emp. Form.C30H27F3N6O5
Mol. Mass.608.5678
SMILESCOc1cc(cc(OC)c1OC)-c1nc([nH]c1C(=O)Nc1ccc(C)c(Nc2ccc3ncn(C)c(=O)c3c2)c1)C(F)(F)F