Reaction Details
TargetSerine/threonine-protein kinase mTOR
LigandBDBM50308774
Substrate/Competitorn/a
Meas. Tech.ChEMBL_607468 (CHEMBL1068073)
IC50 0.57±n/a nM
Citation Dehnhardt, CMVenkatesan, AMDelos Santos, EChen, ZSantos, OAyral-Kaloustian, SBrooijmans, NMallon, RHollander, IFeldberg, LLucas, JChaudhary, IYu, KGibbons, JAbraham, RMansour, TS Lead optimization of N-3-substituted 7-morpholinotriazolopyrimidines as dual phosphoinositide 3-kinase/mammalian target of rapamycin inhibitors: discovery of PKI-402. J Med Chem53:798-810 (2010) 
 
Serine/threonine-protein kinase mTOR
Name:Serine/threonine-protein kinase mTOR
Type:Rapamycin target protein
Mol. Mass.:288917.12
Organism:Homo sapiens (Human)
Description:P42345
Residue:2549
BDBM50308774
NameBDBM50308774
Synonyms:1-(4-(3-Cyclopropyl-7-morpholino-3H-[1,2,3]-triazolo[4,5-d]pyrimidin-5-yl)phenyl)-3-(pyridin-3-yl)urea | CHEMBL601462
TypeSmall organic molecule
Emp. Form.C23H23N9O2
Mol. Mass.457.4878
SMILESO=C(Nc1ccc(cc1)-c1nc(N2CCOCC2)c2nnn(C3CC3)c2n1)Nc1cccnc1