Reaction Details
TargetSerine/threonine-protein kinase mTOR
LigandBDBM50308781
Substrate/Competitorn/a
Meas. Tech.ChEMBL_607468 (CHEMBL1068073)
IC50 0.39±n/a nM
Citation Dehnhardt, CMVenkatesan, AMDelos Santos, EChen, ZSantos, OAyral-Kaloustian, SBrooijmans, NMallon, RHollander, IFeldberg, LLucas, JChaudhary, IYu, KGibbons, JAbraham, RMansour, TS Lead optimization of N-3-substituted 7-morpholinotriazolopyrimidines as dual phosphoinositide 3-kinase/mammalian target of rapamycin inhibitors: discovery of PKI-402. J Med Chem53:798-810 (2010) 
 
Serine/threonine-protein kinase mTOR
Name:Serine/threonine-protein kinase mTOR
Type:Rapamycin target protein
Mol. Mass.:288917.12
Organism:Homo sapiens (Human)
Description:P42345
Residue:2549
BDBM50308781
NameBDBM50308781
Synonyms:4-(3-(4-(3-ethyl-7-morpholino-3H-[1,2,3]triazolo[4,5-d]pyrimidin-5-yl)phenyl)ureido)benzamide | CHEMBL591759
TypeSmall organic molecule
Emp. Form.C24H25N9O3
Mol. Mass.487.5138
SMILESCCn1nnc2c(nc(nc12)-c1ccc(NC(=O)Nc2ccc(cc2)C(N)=O)cc1)N1CCOCC1