Reaction Details
TargetTyrosine-protein phosphatase non-receptor type 1
LigandBDBM50308851
Substrate/Competitorn/a
Meas. Tech.ChEMBL_607676 (CHEMBL1071696)
Ki 9000±n/a nM
Citation Combs, AP Recent advances in the discovery of competitive protein tyrosine phosphatase 1B inhibitors for the treatment of diabetes, obesity, and cancer. J Med Chem53:2333-44 (2010) 
 
Tyrosine-protein phosphatase non-receptor type 1
Name:Tyrosine-protein phosphatase non-receptor type 1
Type:Protein phosphatase
Mol. Mass.:49963.76
Organism:Homo sapiens (Human)
Description:Human recombinant GST-fusion PTP1B (1-435).
Residue:435
BDBM50308851
NameBDBM50308851
Synonyms:(S)-2-(4-(2-acetamido-3-(4-(3-hydroxy-2-(methoxycarbonyl)phenoxy)butylamino)-3-oxopropyl)-2-hydroxyphenoxy)acetic acid 2-{4-[2-ACETYLAMINO-3-(4-CARBOXYMETHOXY-3-HYDROXY-PHENYL)-PROPIONYLAMINO]-BUTOXY}-6-HYDROXY-BENZOIC ACID METHYL ESTER | CHEMBL341103
TypeSmall organic molecule
Emp. Form.C25H30N2O10
Mol. Mass.518.5131
SMILESCOC(=O)c1c(O)cccc1OCCCCNC(=O)[C@H](Cc1ccc(OCC(O)=O)c(O)c1)NC(C)=O