Reaction Details
TargetProstaglandin E2 receptor EP3 subtype
LigandBDBM50308906
Substrate/Competitorn/a
Meas. Tech.ChEMBL_611726 (CHEMBL1074320)
Ki 0.22±n/a nM
Citation Asada, MObitsu, TNagase, TTanaka, MYamaura, YTakizawa, HYoshikawa, KSato, KNarita, MOhuchida, SNakai, HToda, M 3-(2-Aminocarbonylphenyl)propanoic acid analogs as potent and selective EP3 receptor antagonists. Part 1: discovery and exploration of the carboxyamide side chain. Bioorg Med Chem18:80-90 (2010) 
 
Prostaglandin E2 receptor EP3 subtype
Name:Prostaglandin E2 receptor EP3 subtype
Type:G-protein coupled receptor
Mol. Mass.:40092.50
Organism:Mus musculus (Mouse)
Description:n/a
Residue:365
BDBM50308906
NameBDBM50308906
Synonyms:3-[2-({[(1R)-1-(1-Naphthyl)ethyl]amino}carbonyl)-4-(phenoxymethyl)phenyl]propanoic acid | CHEMBL599154
TypeSmall organic molecule
Emp. Form.C29H27NO4
Mol. Mass.453.529
SMILESC[C@@H](NC(=O)c1cc(COc2ccccc2)ccc1CCC(O)=O)c1cccc2ccccc12