Reaction Details
TargetDelta-type opioid receptor
LigandBDBM50308917
Substrate/Competitorn/a
Meas. Tech.ChEMBL_611745 (CHEMBL1074339)
Ki>4500±n/a nM
Citation Iyer, MRLee, YSDeschamps, JRRothman, RBDersch, CMJacobson, AERice, KC Probes for narcotic receptor mediated phenomena. 40. N-substituted cis-4a-ethyl-1,2,3,4,4a,9a-hexahydrobenzofuro[2,3-c]pyridin-8-ols. Bioorg Med Chem18:91-9 (2010) 
 
Delta-type opioid receptor
Name:Delta-type opioid receptor
Type:G Protein-Coupled Receptor (GPCR)
Mol. Mass.:40382.98
Organism:Homo sapiens (Human)
Description:Competition binding assays were carried out using membrane preparations from transfected HN9.10 cells that constitutively expressed the delta opioid receptor.
Residue:372
BDBM50308917
NameBDBM50308917
Synonyms:CHEMBL592302 | cis-(+/-)-4a-Ethyl-2-(4-fluorophenethyl)-1,2,3,4,4a,9ahexahydrobenzofuro[2,3-c]pyridin-8-ol
TypeSmall organic molecule
Emp. Form.C21H24FNO2
Mol. Mass.341.4192
SMILESCC[C@@]12CCN(CCc3ccc(F)cc3)C[C@@H]1Oc1c2cccc1O