Reaction Details
TargetKappa-type opioid receptor
LigandBDBM50017231
Substrate/Competitorn/a
Meas. Tech.ChEMBL_611746 (CHEMBL1065783)
Ki 88±n/a nM
Citation Iyer, MRLee, YSDeschamps, JRRothman, RBDersch, CMJacobson, AERice, KC Probes for narcotic receptor mediated phenomena. 40. N-substituted cis-4a-ethyl-1,2,3,4,4a,9a-hexahydrobenzofuro[2,3-c]pyridin-8-ols. Bioorg Med Chem18:91-9 (2010) 
 
Kappa-type opioid receptor
Name:Kappa-type opioid receptor
Type:G Protein-Coupled Receptor (GPCR)
Mol. Mass.:42648.76
Organism:Homo sapiens (Human)
Description:P41145
Residue:380
BDBM50017231
NameBDBM50017231
Synonyms:(4aS,9aR)-4a-Ethyl-2-phenethyl-1,2,3,4,4a,9a-hexahydro-benzo[4,5]furo[2,3-c]pyridin-6-ol CHEMBL72180
TypeSmall organic molecule
Emp. Form.C21H25NO2
Mol. Mass.323.4287
SMILESCC[C@@]12CCN(CCc3ccccc3)C[C@@H]1Oc1ccc(O)cc21