Reaction Details
TargetKappa-type opioid receptor
LigandBDBM50308919
Substrate/Competitorn/a
Meas. Tech.ChEMBL_611746 (CHEMBL1065783)
Ki 2880±n/a nM
Citation Iyer, MRLee, YSDeschamps, JRRothman, RBDersch, CMJacobson, AERice, KC Probes for narcotic receptor mediated phenomena. 40. N-substituted cis-4a-ethyl-1,2,3,4,4a,9a-hexahydrobenzofuro[2,3-c]pyridin-8-ols. Bioorg Med Chem18:91-9 (2010) 
 
Kappa-type opioid receptor
Name:Kappa-type opioid receptor
Type:G Protein-Coupled Receptor (GPCR)
Mol. Mass.:42648.76
Organism:Homo sapiens (Human)
Description:P41145
Residue:380
BDBM50308919
NameBDBM50308919
Synonyms:CHEMBL598977 | cis-(+/-)-2-methyl-4a-phenethyl-1,2,3,4,4a,9a-hexahydrobenzofuro[2,3-c]pyridin-8-ol
TypeSmall organic molecule
Emp. Form.C20H23NO2
Mol. Mass.309.4021
SMILESCN1CC[C@]2(CCc3ccccc3)[C@H](C1)Oc1c2cccc1O