Reaction Details
TargetKappa-type opioid receptor
LigandBDBM50308918
Substrate/Competitorn/a
Meas. Tech.ChEMBL_611746 (CHEMBL1065783)
Ki>10000±n/a nM
Citation Iyer, MRLee, YSDeschamps, JRRothman, RBDersch, CMJacobson, AERice, KC Probes for narcotic receptor mediated phenomena. 40. N-substituted cis-4a-ethyl-1,2,3,4,4a,9a-hexahydrobenzofuro[2,3-c]pyridin-8-ols. Bioorg Med Chem18:91-9 (2010) 
 
Kappa-type opioid receptor
Name:Kappa-type opioid receptor
Type:G Protein-Coupled Receptor (GPCR)
Mol. Mass.:42648.76
Organism:Homo sapiens (Human)
Description:P41145
Residue:380
BDBM50308918
NameBDBM50308918
Synonyms:CHEMBL599174 | cis-(+/-)-4a-Ethyl-2-methyl-1,2,3,4,4a,9a-hexahydrobenzofuro-[2,3-c]pyridin-8-ol
TypeSmall organic molecule
Emp. Form.C14H19NO2
Mol. Mass.233.3062
SMILESCC[C@@]12CCN(C)C[C@@H]1Oc1c2cccc1O