Reaction Details
TargetCytosolic phospholipase A2
LigandBDBM50277800
Substrate/Competitorn/a
Meas. Tech.ChEMBL_611785 (CHEMBL1066442)
IC50 5±n/a nM
Citation Forster, LLudwig, JKaptur, MBovens, SElfringhoff, ASHoltfrerich, ALehr, M 1-Indol-1-yl-propan-2-ones and related heterocyclic compounds as dual inhibitors of cytosolic phospholipase A(2)alpha and fatty acid amide hydrolase. Bioorg Med Chem18:945-52 (2010) 
 
Cytosolic phospholipase A2
Name:Cytosolic phospholipase A2
Type:Protein
Mol. Mass.:85219.30
Organism:Homo sapiens (Human)
Description:P47712
Residue:749
BDBM50277800
NameBDBM50277800
Synonyms:1-(3-(4-octylphenoxy)-2-oxopropyl)-1H-indazole-5-carboxylic acid | CHEMBL484413
TypeSmall organic molecule
Emp. Form.C25H30N2O4
Mol. Mass.422.5167
SMILESCCCCCCCCc1ccc(OCC(=O)Cn2ncc3cc(ccc23)C(O)=O)cc1