Reaction Details
TargetIntegrin alpha-4
LigandBDBM50309091
Substrate/Competitorn/a
Meas. Tech.ChEMBL_608124 (CHEMBL1074813)
IC50 0.130000±n/a nM
Citation Reger, TSZunic, JStock, NWang, BSmith, NDMunoz, BGreen, MDGardner, MFJames, JPChen, WAlves, KSi, QTreonze, KMLingham, RBMumford, RA Heterocycle-substituted proline dipeptides as potent VLA-4 antagonists. Bioorg Med Chem Lett20:1173-6 (2010) 
 
Integrin alpha-4
Name:Integrin alpha-4
Type:Membrane Protein
Mol. Mass.:114897.35
Organism:Homo sapiens (Human)
Description:P13612
Residue:1032
BDBM50309091
NameBDBM50309091
Synonyms:(S)-2-((2S,4R)-1-(3-cyanophenylsulfonyl)-4-thiomorpholinopyrrolidine-2-carboxamido)-3-(4-(3,5-dichloroisonicotinamido)phenyl)propanoic acid | CHEMBL601686
TypeSmall organic molecule
Emp. Form.C31H30Cl2N6O6S2
Mol. Mass.717.643
SMILESOC(=O)[C@H](Cc1ccc(NC(=O)c2c(Cl)cncc2Cl)cc1)NC(=O)[C@@H]1C[C@H](CN1S(=O)(=O)c1cccc(c1)C#N)N1CCSCC1