Reaction Details
TargetIntegrin alpha-4
LigandBDBM50309092
Substrate/Competitorn/a
Meas. Tech.ChEMBL_608124 (CHEMBL1074813)
IC50 0.110000±n/a nM
Citation Reger, TSZunic, JStock, NWang, BSmith, NDMunoz, BGreen, MDGardner, MFJames, JPChen, WAlves, KSi, QTreonze, KMLingham, RBMumford, RA Heterocycle-substituted proline dipeptides as potent VLA-4 antagonists. Bioorg Med Chem Lett20:1173-6 (2010) 
 
Integrin alpha-4
Name:Integrin alpha-4
Type:Membrane Protein
Mol. Mass.:114897.35
Organism:Homo sapiens (Human)
Description:P13612
Residue:1032
BDBM50309092
NameBDBM50309092
Synonyms:2-(1-(1-(3-cyanophenylsulfonyl)-4-(2-methylpiperidin-1-yl)pyrrolidin-2-yl)vinylamino)-3-(4-(3,5-dichloroisonicotinamido)phenyl)propanoic acid | CHEMBL601687
TypeSmall organic molecule
Emp. Form.C33H34Cl2N6O6S
Mol. Mass.713.631
SMILESCC1CCCCN1C1CC(N(C1)S(=O)(=O)c1cccc(c1)C#N)C(=O)NC(Cc1ccc(NC(=O)c2c(Cl)cncc2Cl)cc1)C(O)=O