Reaction Details
TargetRho-associated protein kinase 2
LigandBDBM50309098
Substrate/Competitorn/a
Meas. Tech.ChEMBL_608134 (CHEMBL1074823)
IC50 2500±n/a nM
Citation Henderson, AJHadden, MGuo, CDouglas, NDecornez, HHellberg, MRRusinko, AMcLaughlin, MSharif, NDrace, CPatil, R 2,3-Diaminopyrazines as rho kinase inhibitors. Bioorg Med Chem Lett20:1137-40 (2010) 
 
Rho-associated protein kinase 2
Name:Rho-associated protein kinase 2
Type:Protein
Mol. Mass.:160885.43
Organism:Homo sapiens (Human)
Description:O75116
Residue:1388
BDBM50309098
NameBDBM50309098
Synonyms:3-(4-methyl-1,4-diazepan-1-yl)-5-(pyridin-4-yl)pyrazin-2-amine | CHEMBL602706
TypeSmall organic molecule
Emp. Form.C15H20N6
Mol. Mass.284.3595
SMILESCN1CCCN(CC1)c1nc(cnc1N)-c1ccncc1