Reaction Details
TargetRho-associated protein kinase 2
LigandBDBM50309099
Substrate/Competitorn/a
Meas. Tech.ChEMBL_608134 (CHEMBL1074823)
IC50>100000±n/a nM
Citation Henderson, AJHadden, MGuo, CDouglas, NDecornez, HHellberg, MRRusinko, AMcLaughlin, MSharif, NDrace, CPatil, R 2,3-Diaminopyrazines as rho kinase inhibitors. Bioorg Med Chem Lett20:1137-40 (2010) 
 
Rho-associated protein kinase 2
Name:Rho-associated protein kinase 2
Type:Protein
Mol. Mass.:160885.43
Organism:Homo sapiens (Human)
Description:O75116
Residue:1388
BDBM50309099
NameBDBM50309099
Synonyms:3-(4-methyl-1,4-diazepan-1-yl)-5-(2-methylpyridin-4-yl)pyrazin-2-amine | CHEMBL589656
TypeSmall organic molecule
Emp. Form.C16H22N6
Mol. Mass.298.3861
SMILESCN1CCCN(CC1)c1nc(cnc1N)-c1ccnc(C)c1