Reaction Details
TargetRho-associated protein kinase 2
LigandBDBM50309109
Substrate/Competitorn/a
Meas. Tech.ChEMBL_608134 (CHEMBL1074823)
IC50 6700±n/a nM
Citation Henderson, AJHadden, MGuo, CDouglas, NDecornez, HHellberg, MRRusinko, AMcLaughlin, MSharif, NDrace, CPatil, R 2,3-Diaminopyrazines as rho kinase inhibitors. Bioorg Med Chem Lett20:1137-40 (2010) 
 
Rho-associated protein kinase 2
Name:Rho-associated protein kinase 2
Type:Protein
Mol. Mass.:160885.43
Organism:Homo sapiens (Human)
Description:O75116
Residue:1388
BDBM50309109
NameBDBM50309109
Synonyms:CHEMBL589336 | N,N-diethyl-3-(4-methyl-1,4-diazepan-1-yl)-5-(pyridin-4-yl)pyrazin-2-amine
TypeSmall organic molecule
Emp. Form.C19H28N6
Mol. Mass.340.4658
SMILESCCN(CC)c1ncc(nc1N1CCCN(C)CC1)-c1ccncc1