Reaction Details
TargetRho-associated protein kinase 2
LigandBDBM50309105
Substrate/Competitorn/a
Meas. Tech.ChEMBL_608134 (CHEMBL1074823)
IC50 950±n/a nM
Citation Henderson, AJHadden, MGuo, CDouglas, NDecornez, HHellberg, MRRusinko, AMcLaughlin, MSharif, NDrace, CPatil, R 2,3-Diaminopyrazines as rho kinase inhibitors. Bioorg Med Chem Lett20:1137-40 (2010) 
 
Rho-associated protein kinase 2
Name:Rho-associated protein kinase 2
Type:Protein
Mol. Mass.:160885.43
Organism:Homo sapiens (Human)
Description:O75116
Residue:1388
BDBM50309105
NameBDBM50309105
Synonyms:5-(1H-indazol-5-yl)-3-(4-methyl-1,4-diazepan-1-yl)pyrazin-2-amine | CHEMBL590313
TypeSmall organic molecule
Emp. Form.C17H21N7
Mol. Mass.323.3955
SMILESCN1CCCN(CC1)c1nc(cnc1N)-c1ccc2[nH]ncc2c1