Reaction Details
TargetRho-associated protein kinase 1
LigandBDBM50309110
Substrate/Competitorn/a
Meas. Tech.ChEMBL_608133 (CHEMBL1074822)
IC50 42000±n/a nM
Citation Henderson, AJHadden, MGuo, CDouglas, NDecornez, HHellberg, MRRusinko, AMcLaughlin, MSharif, NDrace, CPatil, R 2,3-Diaminopyrazines as rho kinase inhibitors. Bioorg Med Chem Lett20:1137-40 (2010) 
 
Rho-associated protein kinase 1
Name:Rho-associated protein kinase 1
Type:Serine/threonine-protein kinase
Mol. Mass.:158156.77
Organism:Homo sapiens (Human)
Description:Q13464
Residue:1354
BDBM50309110
NameBDBM50309110
Synonyms:2-(3-(4-methyl-1,4-diazepan-1-yl)-5-(pyridin-4-yl)pyrazin-2-ylamino)ethanol | CHEMBL589337
TypeSmall organic molecule
Emp. Form.C17H24N6O
Mol. Mass.328.4121
SMILESCN1CCCN(CC1)c1nc(cnc1NCCO)-c1ccncc1