Reaction Details
TargetRho-associated protein kinase 1
LigandBDBM50309116
Substrate/Competitorn/a
Meas. Tech.ChEMBL_608133 (CHEMBL1074822)
IC50 320±n/a nM
Citation Henderson, AJHadden, MGuo, CDouglas, NDecornez, HHellberg, MRRusinko, AMcLaughlin, MSharif, NDrace, CPatil, R 2,3-Diaminopyrazines as rho kinase inhibitors. Bioorg Med Chem Lett20:1137-40 (2010) 
 
Rho-associated protein kinase 1
Name:Rho-associated protein kinase 1
Type:Serine/threonine-protein kinase
Mol. Mass.:158156.77
Organism:Homo sapiens (Human)
Description:Q13464
Residue:1354
BDBM50309116
NameBDBM50309116
Synonyms:1-(6-(pyridin-4-yl)-3-(pyrrolidin-1-yl)pyrazin-2-yl)-1,4-diazepane | CHEMBL591986
TypeSmall organic molecule
Emp. Form.C18H24N6
Mol. Mass.324.4234
SMILESC1CCN(C1)c1ncc(nc1N1CCCNCC1)-c1ccncc1