Reaction Details
TargetRho-associated protein kinase 1
LigandBDBM50309124
Substrate/Competitorn/a
Meas. Tech.ChEMBL_608133 (CHEMBL1074822)
IC50 300±n/a nM
Citation Henderson, AJHadden, MGuo, CDouglas, NDecornez, HHellberg, MRRusinko, AMcLaughlin, MSharif, NDrace, CPatil, R 2,3-Diaminopyrazines as rho kinase inhibitors. Bioorg Med Chem Lett20:1137-40 (2010) 
 
Rho-associated protein kinase 1
Name:Rho-associated protein kinase 1
Type:Serine/threonine-protein kinase
Mol. Mass.:158156.77
Organism:Homo sapiens (Human)
Description:Q13464
Residue:1354
BDBM50309124
NameBDBM50309124
Synonyms:1-(3-(pyrrolidin-1-yl)-6-(1H-pyrrolo[2,3-b]pyridin-4-yl)pyrazin-2-yl)piperidin-4-amine | CHEMBL599162
TypeSmall organic molecule
Emp. Form.C20H25N7
Mol. Mass.363.4594
SMILESNC1CCN(CC1)c1nc(cnc1N1CCCC1)-c1ccnc2[nH]ccc12