Reaction Details
TargetDisintegrin and metalloproteinase domain-containing protein 17
LigandBDBM50309145
Substrate/Competitorn/a
Meas. Tech.ChEMBL_608472 (CHEMBL1065133)
Ki 164±n/a nM
Citation Rosner, KEGuo, ZOrth, PShipps, GWBelanger, DBChan, TYCurran, PJDai, CDeng, YGirijavallabhan, VMHong, LLavey, BJLee, JFLi, DLiu, ZPopovici-Muller, JTing, PCVaccaro, HWang, LWang, TYu, WZhou, GNiu, XSun, JKozlowski, JALundell, DJMadison, VMcKittrick, BPiwinski, JJShih, NYArshad Siddiqui, MStrickland, CO The discovery of novel tartrate-based TNF-alpha converting enzyme (TACE) inhibitors. Bioorg Med Chem Lett20:1189-93 (2010) 
 
Disintegrin and metalloproteinase domain-containing protein 17
Name:Disintegrin and metalloproteinase domain-containing protein 17
Type:Enzyme
Mol. Mass.:93007.89
Organism:Homo sapiens (Human)
Description:
Residue:824
BDBM50309145
NameBDBM50309145
Synonyms:(2R,3R)-2,3-dihydroxy-4-oxo-4-(2-(thiazol-2-yl)pyrrolidin-1-yl)-N-(2-(thiophen-2-yl)ethyl)butanamide | CHEMBL599156
TypeSmall organic molecule
Emp. Form.C17H21N3O4S2
Mol. Mass.395.496
SMILESO[C@H]([C@@H](O)C(=O)N1CCCC1c1nccs1)C(=O)NCCc1cccs1