Reaction Details
TargetDisintegrin and metalloproteinase domain-containing protein 17
LigandBDBM50309146
Substrate/Competitorn/a
Meas. Tech.ChEMBL_608472 (CHEMBL1065133)
Ki 323±n/a nM
Citation Rosner, KEGuo, ZOrth, PShipps, GWBelanger, DBChan, TYCurran, PJDai, CDeng, YGirijavallabhan, VMHong, LLavey, BJLee, JFLi, DLiu, ZPopovici-Muller, JTing, PCVaccaro, HWang, LWang, TYu, WZhou, GNiu, XSun, JKozlowski, JALundell, DJMadison, VMcKittrick, BPiwinski, JJShih, NYArshad Siddiqui, MStrickland, CO The discovery of novel tartrate-based TNF-alpha converting enzyme (TACE) inhibitors. Bioorg Med Chem Lett20:1189-93 (2010) 
 
Disintegrin and metalloproteinase domain-containing protein 17
Name:Disintegrin and metalloproteinase domain-containing protein 17
Type:Enzyme
Mol. Mass.:93007.89
Organism:Homo sapiens (Human)
Description:
Residue:824
BDBM50309146
NameBDBM50309146
Synonyms:(2R,3R)-4-(2-(2-chlorophenyl)pyrrolidin-1-yl)-2,3-dihydroxy-4-oxo-N-(2-(thiophen-2-yl)ethyl)butanamide | CHEMBL590342
TypeSmall organic molecule
Emp. Form.C20H23ClN2O4S
Mol. Mass.422.926
SMILESO[C@H]([C@@H](O)C(=O)N1CCCC1c1ccccc1Cl)C(=O)NCCc1cccs1