Reaction Details
TargetDisintegrin and metalloproteinase domain-containing protein 17
LigandBDBM50309149
Substrate/Competitorn/a
Meas. Tech.ChEMBL_608472 (CHEMBL1065133)
Ki 13±n/a nM
Citation Rosner, KEGuo, ZOrth, PShipps, GWBelanger, DBChan, TYCurran, PJDai, CDeng, YGirijavallabhan, VMHong, LLavey, BJLee, JFLi, DLiu, ZPopovici-Muller, JTing, PCVaccaro, HWang, LWang, TYu, WZhou, GNiu, XSun, JKozlowski, JALundell, DJMadison, VMcKittrick, BPiwinski, JJShih, NYArshad Siddiqui, MStrickland, CO The discovery of novel tartrate-based TNF-alpha converting enzyme (TACE) inhibitors. Bioorg Med Chem Lett20:1189-93 (2010) 
 
Disintegrin and metalloproteinase domain-containing protein 17
Name:Disintegrin and metalloproteinase domain-containing protein 17
Type:Enzyme
Mol. Mass.:93007.89
Organism:Homo sapiens (Human)
Description:
Residue:824
BDBM50309149
NameBDBM50309149
Synonyms:(2R,3R)-2,3-dihydroxy-N-methyl-4-oxo-N-(2-(thiophen-2-yl)ethyl)-4-(2-m-tolylpyrrolidin-1-yl)butanamide | CHEMBL590821
TypeSmall organic molecule
Emp. Form.C22H28N2O4S
Mol. Mass.416.534
SMILESCN(CCc1cccs1)C(=O)[C@H](O)[C@@H](O)C(=O)N1CCCC1c1cccc(C)c1