Reaction Details
TargetDisintegrin and metalloproteinase domain-containing protein 17
LigandBDBM50309151
Substrate/Competitorn/a
Meas. Tech.ChEMBL_608472 (CHEMBL1065133)
Ki 41±n/a nM
Citation Rosner, KEGuo, ZOrth, PShipps, GWBelanger, DBChan, TYCurran, PJDai, CDeng, YGirijavallabhan, VMHong, LLavey, BJLee, JFLi, DLiu, ZPopovici-Muller, JTing, PCVaccaro, HWang, LWang, TYu, WZhou, GNiu, XSun, JKozlowski, JALundell, DJMadison, VMcKittrick, BPiwinski, JJShih, NYArshad Siddiqui, MStrickland, CO The discovery of novel tartrate-based TNF-alpha converting enzyme (TACE) inhibitors. Bioorg Med Chem Lett20:1189-93 (2010) 
 
Disintegrin and metalloproteinase domain-containing protein 17
Name:Disintegrin and metalloproteinase domain-containing protein 17
Type:Enzyme
Mol. Mass.:93007.89
Organism:Homo sapiens (Human)
Description:
Residue:824
BDBM50309151
NameBDBM50309151
Synonyms:(2R,3R)-4-(2-(3-(dimethylamino)phenyl)pyrrolidin-1-yl)-2,3-dihydroxy-4-oxo-N-(2-(thiophen-2-yl)ethyl)butanamide | CHEMBL591535
TypeSmall organic molecule
Emp. Form.C22H29N3O4S
Mol. Mass.431.548
SMILESCN(C)c1cccc(c1)C1CCCN1C(=O)[C@H](O)[C@@H](O)C(=O)NCCc1cccs1