Reaction Details
TargetPoly [ADP-ribose] polymerase 1
LigandBDBM50309234
Substrate/Competitorn/a
Meas. Tech.ChEMBL_608838 (CHEMBL1069057)
IC50 2.4±n/a nM
Citation Ferrigno, FBranca, DKinzel, OLillini, SLlauger Bufi, LMonteagudo, EMuraglia, ERowley, MSchultz-Fademrecht, CToniatti, CTorrisi, CJones, P Development of substituted 6-[4-fluoro-3-(piperazin-1-ylcarbonyl)benzyl]-4,5-dimethylpyridazin-3(2H)-ones as potent poly(ADP-ribose) polymerase-1 (PARP-1) inhibitors active in BRCA deficient cells. Bioorg Med Chem Lett20:1100-5 (2010) 
 
Poly [ADP-ribose] polymerase 1
Name:Poly [ADP-ribose] polymerase 1
Type:n/a
Mol. Mass.:113114.22
Organism:Homo sapiens (Human)
Description:P09874
Residue:1014
BDBM50309234
NameBDBM50309234
Synonyms:6-(3-(4-(1-(cyclopropylmethylamino)cyclopentanecarbonyl)piperazine-1-carbonyl)-4-fluorobenzyl)-4,5-dimethylpyridazin-3(2H)-one | CHEMBL597314
TypeSmall organic molecule
Emp. Form.C28H36FN5O3
Mol. Mass.509.6155
SMILESCc1c(Cc2ccc(F)c(c2)C(=O)N2CCN(CC2)C(=O)C2(CCCC2)NCC2CC2)n[nH]c(=O)c1C