Reaction Details
TargetPoly [ADP-ribose] polymerase 1
LigandBDBM50309252
Substrate/Competitorn/a
Meas. Tech.ChEMBL_608838 (CHEMBL1069057)
IC50 4.2±n/a nM
Citation Ferrigno, FBranca, DKinzel, OLillini, SLlauger Bufi, LMonteagudo, EMuraglia, ERowley, MSchultz-Fademrecht, CToniatti, CTorrisi, CJones, P Development of substituted 6-[4-fluoro-3-(piperazin-1-ylcarbonyl)benzyl]-4,5-dimethylpyridazin-3(2H)-ones as potent poly(ADP-ribose) polymerase-1 (PARP-1) inhibitors active in BRCA deficient cells. Bioorg Med Chem Lett20:1100-5 (2010) 
 
Poly [ADP-ribose] polymerase 1
Name:Poly [ADP-ribose] polymerase 1
Type:n/a
Mol. Mass.:113114.22
Organism:Homo sapiens (Human)
Description:P09874
Residue:1014
BDBM50309252
NameBDBM50309252
Synonyms:(S)-6-(4-fluoro-3-(4-(2-(4-fluorobenzyl)pyrrolidine-2-carbonyl)piperazine-1-carbonyl)benzyl)-4,5-dimethylpyridazin-3(2H)-one | CHEMBL592487
TypeSmall organic molecule
Emp. Form.C30H33F2N5O3
Mol. Mass.549.6115
SMILESCc1c(C)c(=O)[nH]nc1Cc1ccc(F)c(c1)C(=O)N1CCN(CC1)C(=O)[C@@]1(Cc2ccc(F)cc2)CCCN1