Reaction Details
TargetProstaglandin D2 receptor 2
LigandBDBM50309287
Substrate/Competitorn/a
Meas. Tech.ChEMBL_609122 (CHEMBL1066570)
IC50 4.1±n/a nM
Citation Grimstrup, MRist, ØReceveur, JMFrimurer, TMUlven, TMathiesen, JMKostenis, EHögberg, T Novel selective thiazoleacetic acids as CRTH2 antagonists developed from in silico derived hits. Part 2. Bioorg Med Chem Lett20:1181-5 (2010) 
 
Prostaglandin D2 receptor 2
Name:Prostaglandin D2 receptor 2
Type:Enzyme
Mol. Mass.:43295.45
Organism:Homo sapiens (Human)
Description:Q9Y5Y4
Residue:395
BDBM50309287
NameBDBM50309287
Synonyms:2-(2-benzhydryl-4-(3,4-difluorophenyl)thiazol-5-yl)acetic acid | CHEMBL590398
TypeSmall organic molecule
Emp. Form.C24H17F2NO2S
Mol. Mass.421.459
SMILESOC(=O)Cc1sc(nc1-c1ccc(F)c(F)c1)C(c1ccccc1)c1ccccc1