Reaction Details
TargetProstaglandin D2 receptor 2
LigandBDBM50309278
Substrate/Competitorn/a
Meas. Tech.ChEMBL_609122 (CHEMBL1066570)
IC50 8.4±n/a nM
Citation Grimstrup, MRist, ØReceveur, JMFrimurer, TMUlven, TMathiesen, JMKostenis, EHögberg, T Novel selective thiazoleacetic acids as CRTH2 antagonists developed from in silico derived hits. Part 2. Bioorg Med Chem Lett20:1181-5 (2010) 
 
Prostaglandin D2 receptor 2
Name:Prostaglandin D2 receptor 2
Type:Enzyme
Mol. Mass.:43295.45
Organism:Homo sapiens (Human)
Description:Q9Y5Y4
Residue:395
BDBM50309278
NameBDBM50309278
Synonyms:2-(4-(4-chlorophenyl)-2-((4-methoxyphenyl)(phenyl)methyl)thiazol-5-yl)acetic acid | CHEMBL597942
TypeSmall organic molecule
Emp. Form.C25H20ClNO3S
Mol. Mass.449.949
SMILESCOc1ccc(cc1)C(c1nc(c(CC(O)=O)s1)-c1ccc(Cl)cc1)c1ccccc1