Reaction Details
TargetProstaglandin D2 receptor 2
LigandBDBM50309323
Substrate/Competitorn/a
Meas. Tech.ChEMBL_609122 (CHEMBL1066570)
IC50 4.8±n/a nM
Citation Grimstrup, MRist, ØReceveur, JMFrimurer, TMUlven, TMathiesen, JMKostenis, EHögberg, T Novel selective thiazoleacetic acids as CRTH2 antagonists developed from in silico derived hits. Part 2. Bioorg Med Chem Lett20:1181-5 (2010) 
 
Prostaglandin D2 receptor 2
Name:Prostaglandin D2 receptor 2
Type:Enzyme
Mol. Mass.:43295.45
Organism:Homo sapiens (Human)
Description:Q9Y5Y4
Residue:395
BDBM50309323
NameBDBM50309323
Synonyms:2-(4-(2-aminopyridin-4-yl)-2-(bis(4-fluorophenyl)methyl)thiazol-5-yl)acetic acid | CHEMBL592700
TypeSmall organic molecule
Emp. Form.C23H17F2N3O2S
Mol. Mass.437.462
SMILESNc1cc(ccn1)-c1nc(sc1CC(O)=O)C(c1ccc(F)cc1)c1ccc(F)cc1