Reaction Details
TargetProstaglandin D2 receptor 2
LigandBDBM50309294
Substrate/Competitorn/a
Meas. Tech.ChEMBL_609122 (CHEMBL1066570)
IC50 3.4±n/a nM
Citation Grimstrup, MRist, ØReceveur, JMFrimurer, TMUlven, TMathiesen, JMKostenis, EHögberg, T Novel selective thiazoleacetic acids as CRTH2 antagonists developed from in silico derived hits. Part 2. Bioorg Med Chem Lett20:1181-5 (2010) 
 
Prostaglandin D2 receptor 2
Name:Prostaglandin D2 receptor 2
Type:Enzyme
Mol. Mass.:43295.45
Organism:Homo sapiens (Human)
Description:Q9Y5Y4
Residue:395
BDBM50309294
NameBDBM50309294
Synonyms:2-(4-(4-fluorophenyl)-2-((4-hydroxyphenyl)(phenyl)methyl)thiazol-5-yl)acetic acid | CHEMBL607082
TypeSmall organic molecule
Emp. Form.C24H18FNO3S
Mol. Mass.419.468
SMILESOC(=O)Cc1sc(nc1-c1ccc(F)cc1)C(c1ccccc1)c1ccc(O)cc1