Reaction Details
TargetPoly [ADP-ribose] polymerase 1
LigandBDBM50309367
Substrate/Competitorn/a
Meas. Tech.ChEMBL_609454 (CHEMBL1069748)
IC50 2.5±n/a nM
Citation Pescatore, GBranca, DFiore, FKinzel, OBufi, LLMuraglia, EOrvieto, FRowley, MToniatti, CTorrisi, CJones, P Identification and SAR of novel pyrrolo[1,2-a]pyrazin-1(2H)-one derivatives as inhibitors of poly(ADP-ribose) polymerase-1 (PARP-1). Bioorg Med Chem Lett20:1094-9 (2010) 
 
Poly [ADP-ribose] polymerase 1
Name:Poly [ADP-ribose] polymerase 1
Type:n/a
Mol. Mass.:113114.22
Organism:Homo sapiens (Human)
Description:P09874
Residue:1014
BDBM50309367
NameBDBM50309367
Synonyms:6,7-dichloro-4-(3-(4-(2-(dimethylamino)acetyl)piperazine-1-carbonyl)-4-fluorobenzyl)pyrrolo[1,2-a]pyrazin-1(2H)-one | CHEMBL597117
TypeSmall organic molecule
Emp. Form.C23H24Cl2FN5O3
Mol. Mass.508.373
SMILESCN(C)CC(=O)N1CCN(CC1)C(=O)c1cc(Cc2c[nH]c(=O)c3cc(Cl)c(Cl)n23)ccc1F