Reaction Details
TargetPoly [ADP-ribose] polymerase 1
LigandBDBM50309368
Substrate/Competitorn/a
Meas. Tech.ChEMBL_609454 (CHEMBL1069748)
IC50 2±n/a nM
Citation Pescatore, GBranca, DFiore, FKinzel, OBufi, LLMuraglia, EOrvieto, FRowley, MToniatti, CTorrisi, CJones, P Identification and SAR of novel pyrrolo[1,2-a]pyrazin-1(2H)-one derivatives as inhibitors of poly(ADP-ribose) polymerase-1 (PARP-1). Bioorg Med Chem Lett20:1094-9 (2010) 
 
Poly [ADP-ribose] polymerase 1
Name:Poly [ADP-ribose] polymerase 1
Type:n/a
Mol. Mass.:113114.22
Organism:Homo sapiens (Human)
Description:P09874
Residue:1014
BDBM50309368
NameBDBM50309368
Synonyms:2-(4-(5-((6,7-dichloro-1-oxo-1,2-dihydropyrrolo[1,2-a]pyrazin-4-yl)methyl)-2-fluorobenzoyl)piperazin-1-yl)-N,N-dimethyl-2-oxoacetamide | CHEMBL603873
TypeSmall organic molecule
Emp. Form.C23H22Cl2FN5O4
Mol. Mass.522.356
SMILESCN(C)C(=O)C(=O)N1CCN(CC1)C(=O)c1cc(Cc2c[nH]c(=O)c3cc(Cl)c(Cl)n23)ccc1F