Reaction Details
TargetPoly [ADP-ribose] polymerase 1
LigandBDBM50309375
Substrate/Competitorn/a
Meas. Tech.ChEMBL_609454 (CHEMBL1069748)
IC50 1±n/a nM
Citation Pescatore, GBranca, DFiore, FKinzel, OBufi, LLMuraglia, EOrvieto, FRowley, MToniatti, CTorrisi, CJones, P Identification and SAR of novel pyrrolo[1,2-a]pyrazin-1(2H)-one derivatives as inhibitors of poly(ADP-ribose) polymerase-1 (PARP-1). Bioorg Med Chem Lett20:1094-9 (2010) 
 
Poly [ADP-ribose] polymerase 1
Name:Poly [ADP-ribose] polymerase 1
Type:n/a
Mol. Mass.:113114.22
Organism:Homo sapiens (Human)
Description:P09874
Residue:1014
BDBM50309375
NameBDBM50309375
Synonyms:6,7-dichloro-4-(4-fluoro-3-(4-pivaloylpiperazine-1-carbonyl)benzyl)pyrrolo[1,2-a]pyrazin-1(2H)-one | CHEMBL598543
TypeSmall organic molecule
Emp. Form.C24H25Cl2FN4O3
Mol. Mass.507.385
SMILESCC(C)(C)C(=O)N1CCN(CC1)C(=O)c1cc(Cc2c[nH]c(=O)c3cc(Cl)c(Cl)n23)ccc1F